{"text_format":"1","workbook":"xlsx","n_sheets":5,"sheets":["How To Use this Workbook","Unit Calculator","DD Budget","Base Budget Calculator","Rates"],"not_rendered":{"charts":0,"images":5,"macros":1,"external_links":0,"defined_names":4,"comments":1,"pivot_tables":0},"unopened":[],"bounds":{"document_bytes":16777216,"sheet_cells":100000,"rows_first":2000,"rows_last":500,"rows_between":2000,"halvings":0,"cell_chars":16384,"cell_head_chars":4096},"cells_cut":0,"cells_raw":0,"read":"whole","date_system":"1900"}

{"sheet":"How To Use this Workbook","index":0,"n_rows":55,"n_cols":15,"rows_kept":55,"cut":false,"hidden":false,"merged":[[37,12,37,13],[38,12,38,13],[39,12,39,13],[41,12,41,13],[15,12,15,13],[16,12,16,13],[18,12,18,13],[34,12,34,13],[35,12,35,13]]}
[]
[]
[]
[]
[]
[]
[]
[]
[]
[]
[]
[]
[]
[]
[]
[null,null,null,null,null,null,null,null,null,null,null,null,"Base Budget Total: ",null,"Total of all services in the budget that are part of a person's \"Base Budget\" Services"]
[null,null,null,null,null,null,null,null,null,null,null,null,"Annual Budget:",null,"Sum of all of a person's services for the year except those services that are consultative, "]
[null,null,null,null,null,null,null,null,null,null,null,null,null,null,"add-ons or equipment/modifications"]
[null,null,null,null,null,null,null,null,null,null,null,null,"Total:",null,"Sum of all of a person's services for the year (Annual Budget + Equipment, Consultative,"]
[null,null,null,null,null,null,null,null,null,null,null,null,null,null,"and add-on services."]
[]
[]
[]
[]
[]
[]
[]
[]
[]
[]
{"$rows_left_out":26}
{"sheet":"Unit Calculator","index":1,"n_rows":45,"n_cols":6,"rows_kept":45,"cut":false,"hidden":false,"merged":[[39,0,39,1],[42,0,42,6],[0,0,0,2],[4,1,4,2],[8,1,8,2],[23,1,23,2],[27,1,27,2],[38,0,38,6]]}
["Unit Calculator"]
[]
[null,"If Service limitation is based upon hours for a certain time period, use the following:"]
[null,"Dates for Authorization",null,"Start Date","End Date","Total Days:"]
[null,null,null,null,null,{"$f":"DATEDIF(D5,E5,\"d\")+1","v":1}]
[]
[]
[null,"Service Limitation"]
[null,"Hours Per:",null,"Week","Month"]
[null,null,"Total on Auth",{"$f":"F5/7","v":0.14000000000000001},{"$f":"F5/30","v":0.03}]
[null,null,null," "]
[null,null,null,{"$f":"SUM(D10*D11)*4","v":{"$error":"#VALUE!"}},{"$f":"SUM(E10*E11)*4","v":0},{"$f":"((F11/12)*ROUNDDOWN(E10,0)*4)","v":0}]
[]
[]
[null,"Number of Units Needed"]
[null,null,null,{"$f":"IFERROR(ROUND(D12,0),\"\")","v":""},{"$f":"ROUND(E12,0)","v":0}]
[]
[]
[]
[]
[null,"If Service Limitation is based upon units for a  certain time period, use the following:"]
[]
[null,"Dates for Authorization",null,"Start Date","End Date","Total Days:"]
[null,null,null,null,null,{"$f":"DATEDIF(D24,E24,\"d\")+1","v":1}]
[]
[]
[null,"Service Limitation"]
[null,"Units Per:",null,"Week","Month"]
[null,null,"Total on Auth",{"$f":"F24/7","v":0.14000000000000001},{"$f":"F24/30","v":0.03}]
[]
{"$rows_left_out":16}
{"sheet":"DD Budget","index":2,"n_rows":38,"n_cols":10,"rows_kept":38,"cut":false,"hidden":false,"merged":[[18,14,20,14],[5,0,5,9],[46,16,46,17],[25,1,25,2],[25,3,26,3],[25,4,26,6],[25,7,26,7],[25,8,26,8],[24,0,24,8],[29,0,31,4]]}
[null,null,null,null,null,null,null,null,null,"Rev. 12/18/2023"]
[]
["Client:",null,null,null,null,null,null,"Record Number:"]
[]
[]
["NC Innovations Individual Budget"]
["Effective Date:"]
[]
["Service Code:","Provider:","Qualifier:","Units Requested:","Rate:","Total","Start Date:","End Date:","Notes:","Discontinued Date:"]
[null,null,null,null,{"$f":"IFERROR(IF(AND($B10=\"Autism Society of North Carolina\",$G10<DATE(2022,2,1)),VLOOKUP($A10,ASNC_Rates[],2,FALSE),IF(AND($B10=\"Autism Society of North Carolina\",$G10<DATE(2022,3,1)),VLOOKUP($A10,ASNC_Rates[],3,FALSE), IF(AND($B10=\"Autism Society of North Carolina\",$G10<DATE(2022,10,1)),VLOOKUP($A10,ASNC_Rates[],4,FALSE), IF(AND($B10=\"Autism Society of North Carolina\",$G10<DATE(2023,7,1)),VLOOKUP($A10,ASNC_Rates[],5,FALSE),IF($B10=\"Autism Society of North Carolina\",VLOOKUP($A10,ASNC_Rates[],6,FALSE),IF($G10<DATE(2022,2,1),VLOOKUP($A10,RateLookup2015[],5,FALSE),IF($G10<DATE(2022,3,1),VLOOKUP($A10,RateLookup2015[],6,FALSE),IF($G10<DATE(2022,10,1),VLOOKUP($A10,RateLookup2015[],7,FALSE),IF($G10<DATE(2023,7,1),VLOOKUP($A10,RateLookup2015[],8,FALSE),VLOOKUP($A10,RateLookup2015[],9,FALSE)))))))))),\"\")","v":""},{"$f":"IFERROR(D10*E10,\"\")","v":""}]
[{"$f":"TRIM(B11&\" \"&C11)","v":""},null,null,null,{"$f":"IFERROR(IF(AND($B11=\"Autism Society of North Carolina\",$G11<DATE(2022,2,1)),VLOOKUP($A11,ASNC_Rates[],2,FALSE),IF(AND($B11=\"Autism Society of North Carolina\",$G11<DATE(2022,3,1)),VLOOKUP($A11,ASNC_Rates[],3,FALSE), IF(AND($B11=\"Autism Society of North Carolina\",$G11<DATE(2022,10,1)),VLOOKUP($A11,ASNC_Rates[],4,FALSE), IF(AND($B11=\"Autism Society of North Carolina\",$G11<DATE(2023,7,1)),VLOOKUP($A11,ASNC_Rates[],5,FALSE),IF($B11=\"Autism Society of North Carolina\",VLOOKUP($A11,ASNC_Rates[],6,FALSE),IF($G11<DATE(2022,2,1),VLOOKUP($A11,RateLookup2015[],5,FALSE),IF($G11<DATE(2022,3,1),VLOOKUP($A11,RateLookup2015[],6,FALSE),IF($G11<DATE(2022,10,1),VLOOKUP($A11,RateLookup2015[],7,FALSE),IF($G11<DATE(2023,7,1),VLOOKUP($A11,RateLookup2015[],8,FALSE),VLOOKUP($A11,RateLookup2015[],9,FALSE)))))))))),\"\")","v":""},{"$f":"IFERROR(D11*E11,\"\")","v":""}]
["",null,null,null,{"$f":"IFERROR(IF(AND($B12=\"Autism Society of North Carolina\",$G12<DATE(2022,2,1)),VLOOKUP($A12,ASNC_Rates[],2,FALSE),IF(AND($B12=\"Autism Society of North Carolina\",$G12<DATE(2022,3,1)),VLOOKUP($A12,ASNC_Rates[],3,FALSE), IF(AND($B12=\"Autism Society of North Carolina\",$G12<DATE(2022,10,1)),VLOOKUP($A12,ASNC_Rates[],4,FALSE), IF(AND($B12=\"Autism Society of North Carolina\",$G12<DATE(2023,7,1)),VLOOKUP($A12,ASNC_Rates[],5,FALSE),IF($B12=\"Autism Society of North Carolina\",VLOOKUP($A12,ASNC_Rates[],6,FALSE),IF($G12<DATE(2022,2,1),VLOOKUP($A12,RateLookup2015[],5,FALSE),IF($G12<DATE(2022,3,1),VLOOKUP($A12,RateLookup2015[],6,FALSE),IF($G12<DATE(2022,10,1),VLOOKUP($A12,RateLookup2015[],7,FALSE),IF($G12<DATE(2023,7,1),VLOOKUP($A12,RateLookup2015[],8,FALSE),VLOOKUP($A12,RateLookup2015[],9,FALSE)))))))))),\"\")","v":""},""]
["",null,null,null,{"$f":"IFERROR(IF(AND($B13=\"Autism Society of North Carolina\",$G13<DATE(2022,2,1)),VLOOKUP($A13,ASNC_Rates[],2,FALSE),IF(AND($B13=\"Autism Society of North Carolina\",$G13<DATE(2022,3,1)),VLOOKUP($A13,ASNC_Rates[],3,FALSE), IF(AND($B13=\"Autism Society of North Carolina\",$G13<DATE(2022,10,1)),VLOOKUP($A13,ASNC_Rates[],4,FALSE), IF(AND($B13=\"Autism Society of North Carolina\",$G13<DATE(2023,7,1)),VLOOKUP($A13,ASNC_Rates[],5,FALSE),IF($B13=\"Autism Society of North Carolina\",VLOOKUP($A13,ASNC_Rates[],6,FALSE),IF($G13<DATE(2022,2,1),VLOOKUP($A13,RateLookup2015[],5,FALSE),IF($G13<DATE(2022,3,1),VLOOKUP($A13,RateLookup2015[],6,FALSE),IF($G13<DATE(2022,10,1),VLOOKUP($A13,RateLookup2015[],7,FALSE),IF($G13<DATE(2023,7,1),VLOOKUP($A13,RateLookup2015[],8,FALSE),VLOOKUP($A13,RateLookup2015[],9,FALSE)))))))))),\"\")","v":""},""]
["",null,null,null,{"$f":"IFERROR(IF(AND($B14=\"Autism Society of North Carolina\",$G14<DATE(2022,2,1)),VLOOKUP($A14,ASNC_Rates[],2,FALSE),IF(AND($B14=\"Autism Society of North Carolina\",$G14<DATE(2022,3,1)),VLOOKUP($A14,ASNC_Rates[],3,FALSE), IF(AND($B14=\"Autism Society of North Carolina\",$G14<DATE(2022,10,1)),VLOOKUP($A14,ASNC_Rates[],4,FALSE), IF(AND($B14=\"Autism Society of North Carolina\",$G14<DATE(2023,7,1)),VLOOKUP($A14,ASNC_Rates[],5,FALSE),IF($B14=\"Autism Society of North Carolina\",VLOOKUP($A14,ASNC_Rates[],6,FALSE),IF($G14<DATE(2022,2,1),VLOOKUP($A14,RateLookup2015[],5,FALSE),IF($G14<DATE(2022,3,1),VLOOKUP($A14,RateLookup2015[],6,FALSE),IF($G14<DATE(2022,10,1),VLOOKUP($A14,RateLookup2015[],7,FALSE),IF($G14<DATE(2023,7,1),VLOOKUP($A14,RateLookup2015[],8,FALSE),VLOOKUP($A14,RateLookup2015[],9,FALSE)))))))))),\"\")","v":""},""]
["",null,null,null,{"$f":"IFERROR(IF(AND($B15=\"Autism Society of North Carolina\",$G15<DATE(2022,2,1)),VLOOKUP($A15,ASNC_Rates[],2,FALSE),IF(AND($B15=\"Autism Society of North Carolina\",$G15<DATE(2022,3,1)),VLOOKUP($A15,ASNC_Rates[],3,FALSE), IF(AND($B15=\"Autism Society of North Carolina\",$G15<DATE(2022,10,1)),VLOOKUP($A15,ASNC_Rates[],4,FALSE), IF(AND($B15=\"Autism Society of North Carolina\",$G15<DATE(2023,7,1)),VLOOKUP($A15,ASNC_Rates[],5,FALSE),IF($B15=\"Autism Society of North Carolina\",VLOOKUP($A15,ASNC_Rates[],6,FALSE),IF($G15<DATE(2022,2,1),VLOOKUP($A15,RateLookup2015[],5,FALSE),IF($G15<DATE(2022,3,1),VLOOKUP($A15,RateLookup2015[],6,FALSE),IF($G15<DATE(2022,10,1),VLOOKUP($A15,RateLookup2015[],7,FALSE),IF($G15<DATE(2023,7,1),VLOOKUP($A15,RateLookup2015[],8,FALSE),VLOOKUP($A15,RateLookup2015[],9,FALSE)))))))))),\"\")","v":""},""]
["",null,null,null,{"$f":"IFERROR(IF(AND($B16=\"Autism Society of North Carolina\",$G16<DATE(2022,2,1)),VLOOKUP($A16,ASNC_Rates[],2,FALSE),IF(AND($B16=\"Autism Society of North Carolina\",$G16<DATE(2022,3,1)),VLOOKUP($A16,ASNC_Rates[],3,FALSE), IF(AND($B16=\"Autism Society of North Carolina\",$G16<DATE(2022,10,1)),VLOOKUP($A16,ASNC_Rates[],4,FALSE), IF(AND($B16=\"Autism Society of North Carolina\",$G16<DATE(2023,7,1)),VLOOKUP($A16,ASNC_Rates[],5,FALSE),IF($B16=\"Autism Society of North Carolina\",VLOOKUP($A16,ASNC_Rates[],6,FALSE),IF($G16<DATE(2022,2,1),VLOOKUP($A16,RateLookup2015[],5,FALSE),IF($G16<DATE(2022,3,1),VLOOKUP($A16,RateLookup2015[],6,FALSE),IF($G16<DATE(2022,10,1),VLOOKUP($A16,RateLookup2015[],7,FALSE),IF($G16<DATE(2023,7,1),VLOOKUP($A16,RateLookup2015[],8,FALSE),VLOOKUP($A16,RateLookup2015[],9,FALSE)))))))))),\"\")","v":""},""]
["",null,null,null,{"$f":"IFERROR(IF(AND($B17=\"Autism Society of North Carolina\",$G17<DATE(2022,2,1)),VLOOKUP($A17,ASNC_Rates[],2,FALSE),IF(AND($B17=\"Autism Society of North Carolina\",$G17<DATE(2022,3,1)),VLOOKUP($A17,ASNC_Rates[],3,FALSE), IF(AND($B17=\"Autism Society of North Carolina\",$G17<DATE(2022,10,1)),VLOOKUP($A17,ASNC_Rates[],4,FALSE), IF(AND($B17=\"Autism Society of North Carolina\",$G17<DATE(2023,7,1)),VLOOKUP($A17,ASNC_Rates[],5,FALSE),IF($B17=\"Autism Society of North Carolina\",VLOOKUP($A17,ASNC_Rates[],6,FALSE),IF($G17<DATE(2022,2,1),VLOOKUP($A17,RateLookup2015[],5,FALSE),IF($G17<DATE(2022,3,1),VLOOKUP($A17,RateLookup2015[],6,FALSE),IF($G17<DATE(2022,10,1),VLOOKUP($A17,RateLookup2015[],7,FALSE),IF($G17<DATE(2023,7,1),VLOOKUP($A17,RateLookup2015[],8,FALSE),VLOOKUP($A17,RateLookup2015[],9,FALSE)))))))))),\"\")","v":""},""]
["",null,null,null,{"$f":"IFERROR(IF(AND($B18=\"Autism Society of North Carolina\",$G18<DATE(2022,2,1)),VLOOKUP($A18,ASNC_Rates[],2,FALSE),IF(AND($B18=\"Autism Society of North Carolina\",$G18<DATE(2022,3,1)),VLOOKUP($A18,ASNC_Rates[],3,FALSE), IF(AND($B18=\"Autism Society of North Carolina\",$G18<DATE(2022,10,1)),VLOOKUP($A18,ASNC_Rates[],4,FALSE), IF(AND($B18=\"Autism Society of North Carolina\",$G18<DATE(2023,7,1)),VLOOKUP($A18,ASNC_Rates[],5,FALSE),IF($B18=\"Autism Society of North Carolina\",VLOOKUP($A18,ASNC_Rates[],6,FALSE),IF($G18<DATE(2022,2,1),VLOOKUP($A18,RateLookup2015[],5,FALSE),IF($G18<DATE(2022,3,1),VLOOKUP($A18,RateLookup2015[],6,FALSE),IF($G18<DATE(2022,10,1),VLOOKUP($A18,RateLookup2015[],7,FALSE),IF($G18<DATE(2023,7,1),VLOOKUP($A18,RateLookup2015[],8,FALSE),VLOOKUP($A18,RateLookup2015[],9,FALSE)))))))))),\"\")","v":""},""]
["",null,null,null,{"$f":"IFERROR(IF(AND($B19=\"Autism Society of North Carolina\",$G19<DATE(2022,2,1)),VLOOKUP($A19,ASNC_Rates[],2,FALSE),IF(AND($B19=\"Autism Society of North Carolina\",$G19<DATE(2022,3,1)),VLOOKUP($A19,ASNC_Rates[],3,FALSE), IF(AND($B19=\"Autism Society of North Carolina\",$G19<DATE(2022,10,1)),VLOOKUP($A19,ASNC_Rates[],4,FALSE), IF(AND($B19=\"Autism Society of North Carolina\",$G19<DATE(2023,7,1)),VLOOKUP($A19,ASNC_Rates[],5,FALSE),IF($B19=\"Autism Society of North Carolina\",VLOOKUP($A19,ASNC_Rates[],6,FALSE),IF($G19<DATE(2022,2,1),VLOOKUP($A19,RateLookup2015[],5,FALSE),IF($G19<DATE(2022,3,1),VLOOKUP($A19,RateLookup2015[],6,FALSE),IF($G19<DATE(2022,10,1),VLOOKUP($A19,RateLookup2015[],7,FALSE),IF($G19<DATE(2023,7,1),VLOOKUP($A19,RateLookup2015[],8,FALSE),VLOOKUP($A19,RateLookup2015[],9,FALSE)))))))))),\"\")","v":""},""]
["",null,null,null,{"$f":"IFERROR(IF(AND($B20=\"Autism Society of North Carolina\",$G20<DATE(2022,2,1)),VLOOKUP($A20,ASNC_Rates[],2,FALSE),IF(AND($B20=\"Autism Society of North Carolina\",$G20<DATE(2022,3,1)),VLOOKUP($A20,ASNC_Rates[],3,FALSE), IF(AND($B20=\"Autism Society of North Carolina\",$G20<DATE(2022,10,1)),VLOOKUP($A20,ASNC_Rates[],4,FALSE), IF(AND($B20=\"Autism Society of North Carolina\",$G20<DATE(2023,7,1)),VLOOKUP($A20,ASNC_Rates[],5,FALSE),IF($B20=\"Autism Society of North Carolina\",VLOOKUP($A20,ASNC_Rates[],6,FALSE),IF($G20<DATE(2022,2,1),VLOOKUP($A20,RateLookup2015[],5,FALSE),IF($G20<DATE(2022,3,1),VLOOKUP($A20,RateLookup2015[],6,FALSE),IF($G20<DATE(2022,10,1),VLOOKUP($A20,RateLookup2015[],7,FALSE),IF($G20<DATE(2023,7,1),VLOOKUP($A20,RateLookup2015[],8,FALSE),VLOOKUP($A20,RateLookup2015[],9,FALSE)))))))))),\"\")","v":""},""]
["",null,null,null,{"$f":"IFERROR(IF(AND($B21=\"Autism Society of North Carolina\",$G21<DATE(2022,2,1)),VLOOKUP($A21,ASNC_Rates[],2,FALSE),IF(AND($B21=\"Autism Society of North Carolina\",$G21<DATE(2022,3,1)),VLOOKUP($A21,ASNC_Rates[],3,FALSE), IF(AND($B21=\"Autism Society of North Carolina\",$G21<DATE(2022,10,1)),VLOOKUP($A21,ASNC_Rates[],4,FALSE), IF(AND($B21=\"Autism Society of North Carolina\",$G21<DATE(2023,7,1)),VLOOKUP($A21,ASNC_Rates[],5,FALSE),IF($B21=\"Autism Society of North Carolina\",VLOOKUP($A21,ASNC_Rates[],6,FALSE),IF($G21<DATE(2022,2,1),VLOOKUP($A21,RateLookup2015[],5,FALSE),IF($G21<DATE(2022,3,1),VLOOKUP($A21,RateLookup2015[],6,FALSE),IF($G21<DATE(2022,10,1),VLOOKUP($A21,RateLookup2015[],7,FALSE),IF($G21<DATE(2023,7,1),VLOOKUP($A21,RateLookup2015[],8,FALSE),VLOOKUP($A21,RateLookup2015[],9,FALSE)))))))))),\"\")","v":""},""]
["",null,null,null,{"$f":"IFERROR(IF(AND($B22=\"Autism Society of North Carolina\",$G22<DATE(2022,2,1)),VLOOKUP($A22,ASNC_Rates[],2,FALSE),IF(AND($B22=\"Autism Society of North Carolina\",$G22<DATE(2022,3,1)),VLOOKUP($A22,ASNC_Rates[],3,FALSE), IF(AND($B22=\"Autism Society of North Carolina\",$G22<DATE(2022,10,1)),VLOOKUP($A22,ASNC_Rates[],4,FALSE), IF(AND($B22=\"Autism Society of North Carolina\",$G22<DATE(2023,7,1)),VLOOKUP($A22,ASNC_Rates[],5,FALSE),IF($B22=\"Autism Society of North Carolina\",VLOOKUP($A22,ASNC_Rates[],6,FALSE),IF($G22<DATE(2022,2,1),VLOOKUP($A22,RateLookup2015[],5,FALSE),IF($G22<DATE(2022,3,1),VLOOKUP($A22,RateLookup2015[],6,FALSE),IF($G22<DATE(2022,10,1),VLOOKUP($A22,RateLookup2015[],7,FALSE),IF($G22<DATE(2023,7,1),VLOOKUP($A22,RateLookup2015[],8,FALSE),VLOOKUP($A22,RateLookup2015[],9,FALSE)))))))))),\"\")","v":""},{"$f":"IFERROR(D22*E22,\"\")","v":""}]
["",null,null,null,{"$f":"IFERROR(IF(AND($B23=\"Autism Society of North Carolina\",$G23<DATE(2022,2,1)),VLOOKUP($A23,ASNC_Rates[],2,FALSE),IF(AND($B23=\"Autism Society of North Carolina\",$G23<DATE(2022,3,1)),VLOOKUP($A23,ASNC_Rates[],3,FALSE), IF(AND($B23=\"Autism Society of North Carolina\",$G23<DATE(2022,10,1)),VLOOKUP($A23,ASNC_Rates[],4,FALSE), IF(AND($B23=\"Autism Society of North Carolina\",$G23<DATE(2023,7,1)),VLOOKUP($A23,ASNC_Rates[],5,FALSE),IF($B23=\"Autism Society of North Carolina\",VLOOKUP($A23,ASNC_Rates[],6,FALSE),IF($G23<DATE(2022,2,1),VLOOKUP($A23,RateLookup2015[],5,FALSE),IF($G23<DATE(2022,3,1),VLOOKUP($A23,RateLookup2015[],6,FALSE),IF($G23<DATE(2022,10,1),VLOOKUP($A23,RateLookup2015[],7,FALSE),IF($G23<DATE(2023,7,1),VLOOKUP($A23,RateLookup2015[],8,FALSE),VLOOKUP($A23,RateLookup2015[],9,FALSE)))))))))),\"\")","v":""},{"$f":"IFERROR(D23*E23,\"\")","v":""}]
[]
["Innovations"]
["Base Budget Total:",{"$f":"SUMPRODUCT(SUMIF(Budget[Service Code:],BaseBudgetSvs[],Budget[Total]))","v":0},null,"Annual Budget","Equipment and Consultative Services",null,null,"Add Ons","Total"]
["Employer of Record                     Self Directed","Agency w/Choice    Self Directed","Provider Directed"]
[{"$f":"SUMIF(C10:C23,\"Employer of Record\",F10:F23)","v":0},{"$f":"SUMIF(C10:C23,\"Agency with Choice\",F10:F23)","v":0},{"$f":"SUMIF(C10:C23,\"Provider Directed\",F10:F23)","v":0},{"$f":"SUM(A28,B28,C28)","v":0},null,{"$f":"SUMPRODUCT(SUMIF(Budget[Service Code:],EquipandConsulSvs[],Budget[Total]))","v":0},null,{"$f":"SUMPRODUCT(SUMIF(Budget[Service Code:],AddOnSvs[],Budget[Total]))","v":0},{"$f":"SUM(D28,F28,H28)","v":0}]
[]
["Funding Source Summary",null,null,null,null,"Medicaid Waiver C","Medicaid State Plan","Other","Total"]
{"$rows_left_out":9}
{"sheet":"Base Budget Calculator","index":3,"n_rows":25,"n_cols":8,"rows_kept":25,"cut":false,"hidden":false,"merged":[[0,0,1,3]]}
["Base Budget Calculator",null,null,null,null,"Start Date:"]
[null,null,null,null,null,"End Date:"]
[null,null,null,null,null,"Base Budget Allocation:"]
[]
["Service","Rate","Number","Hours or Units","Per","Cost","Balance","Overage"]
[null,{"$f":"IFERROR(VLOOKUP($A6,Rates!$A$2:$G$63,7,FALSE),\"\")","v":""},null,null,null,{"$f":"IFERROR(IF(E6=\"Day\",($G$2-$G$1)+1,IF(E6=\"Week\",ROUND((($G$2-$G$1)+1)/7,2),IF(E6=\"Month\",ROUND((($G$2-$G$1)+1)/30,2),1)))*IF(D6=\"Hours\",4,1)*C6*B6,\"\")","v":""},{"$f":"IFERROR(G3-F6,\"\")","v":""},{"$f":"IF(A6>0,ROUNDUP(IF(G6>0,0,((ABS(G6)/B6)/(IF(D6=\"Hours\",4,1))))/IF(E6=\"Day\",($G$2-$G$1)+1,IF(E6=\"Week\",ROUND((($G$2-$G$1)+1)/7,2),IF(E6=\"Month\",ROUND((($G$2-$G$1)+1)/30,2),1))),0)&\" \"&D6&\" Per \"&E6,\"\")","v":""}]
[null,{"$f":"IFERROR(VLOOKUP($A7,Rates!$A$2:$G$63,7,FALSE),\"\")","v":""},null,null,null,"",{"$f":"IFERROR(G6-F7,\"\")","v":""},""]
[null,{"$f":"IFERROR(VLOOKUP($A8,Rates!$A$2:$G$63,7,FALSE),\"\")","v":""},null,null,null,"",{"$f":"IFERROR(G7-F8,\"\")","v":""},""]
[null,{"$f":"IFERROR(VLOOKUP($A9,Rates!$A$2:$G$63,7,FALSE),\"\")","v":""},null,null,null,"","",""]
[null,{"$f":"IFERROR(VLOOKUP($A10,Rates!$A$2:$G$63,7,FALSE),\"\")","v":""},null,null,null,"","",""]
[null,{"$f":"IFERROR(VLOOKUP($A11,Rates!$A$2:$G$63,7,FALSE),\"\")","v":""},null,null,null,"","",""]
[null,{"$f":"IFERROR(VLOOKUP($A12,Rates!$A$2:$G$63,7,FALSE),\"\")","v":""},null,null,null,"","",""]
[null,{"$f":"IFERROR(VLOOKUP($A13,Rates!$A$2:$G$63,7,FALSE),\"\")","v":""},null,null,null,"","",""]
[null,{"$f":"IFERROR(VLOOKUP($A14,Rates!$A$2:$G$63,7,FALSE),\"\")","v":""},null,null,null,"","",""]
[null,{"$f":"IFERROR(VLOOKUP($A15,Rates!$A$2:$G$63,7,FALSE),\"\")","v":""},null,null,null,"","",""]
[null,{"$f":"IFERROR(VLOOKUP($A16,Rates!$A$2:$G$63,7,FALSE),\"\")","v":""},null,null,null,"","",""]
[null,{"$f":"IFERROR(VLOOKUP($A17,Rates!$A$2:$G$63,7,FALSE),\"\")","v":""},null,null,null,"","",""]
[null,{"$f":"IFERROR(VLOOKUP($A18,Rates!$A$2:$G$63,7,FALSE),\"\")","v":""},null,null,null,"","",""]
[null,{"$f":"IFERROR(VLOOKUP($A19,Rates!$A$2:$G$63,7,FALSE),\"\")","v":""},null,null,null,"","",""]
[null,{"$f":"IFERROR(VLOOKUP($A20,Rates!$A$2:$G$63,7,FALSE),\"\")","v":""},null,null,null,"","",""]
[null,{"$f":"IFERROR(VLOOKUP($A21,Rates!$A$2:$G$63,7,FALSE),\"\")","v":""},null,null,null,"","",""]
[null,{"$f":"IFERROR(VLOOKUP($A22,Rates!$A$2:$G$63,7,FALSE),\"\")","v":""},null,null,null,"","",""]
[null,{"$f":"IFERROR(VLOOKUP($A23,Rates!$A$2:$G$63,7,FALSE),\"\")","v":""},null,null,null,"","",""]
[null,{"$f":"IFERROR(VLOOKUP($A24,Rates!$A$2:$G$63,7,FALSE),\"\")","v":""},null,null,null,"","",""]
[null,{"$f":"IFERROR(VLOOKUP($A25,Rates!$A$2:$G$63,7,FALSE),\"\")","v":""},null,null,null,"","",""]

{"sheet":"Rates","index":4,"n_rows":95,"n_cols":17,"rows_kept":95,"cut":false,"hidden":true,"merged":[]}
["Full Name","Proc. Code","Code Description","Billing Unit","COVID Rate 3/2020-1/31/2022","Rate Feb 2022","COVID Rate 03/01/2022-09/30/2022","Rate October 2022 - June 2023","Rate July 2023 and Onward",null,null,null,"Qualifiers",66]
[{"$f":"TRIM(B2&\" \"&C2)","v":"T2029 Assistive Technology: Equip Supplies"},"T2029","Assistive Technology: Equip Supplies","Invoice","Invoice","Invoice","Invoice","Invoice","Invoice",null,null,null,"Provider Directed"]
["Community Living and Support-All Services",null,"Community Living and Support-All Services","15 min",5.61,6.16,6.73,6.73,7.54,null,null,null,"Employer of Record"]
[{"$f":"TRIM(B4&\" \"&C4)","v":"T2012GC Community Living and Support-Live in Caregiver"},"T2012GC","Community Living and Support-Live in Caregiver","15 min",5.61,5.61,6.16,6.16,7,null,null,null,"Non Base Budget"]
[{"$f":"TRIM(B5&\" \"&C5)","v":"T2012GCHQ Community Living and Support-Live in Caregiver-Group"},"T2012GCHQ","Community Living and Support-Live in Caregiver-Group","15 min",5.61,5.61,3.63,3.63,4.03,null,null,null,"Agency with Choice"]
[{"$f":"TRIM(B6&\" \"&C6)","v":"T2012 Community Living and Support-Community Only"},"T2012","Community Living and Support-Community Only","15 min",5.61,5.61,6.16,6.16,7,null,null,null,"Medicaid"]
[{"$f":"TRIM(B7&\" \"&C7)","v":"T2012HQ Community Living and Support-Community Only-Group"},"T2012HQ","Community Living and Support-Community Only-Group","15 min",5.61,5.61,3.63,3.63,4.03,null,null,null,"State"]
["T2013TF Community Living and Supports Indv","T2013TF","Community Living and Supports Indv","15 min",5.61,6.16,6.73,6.73,7.54,null,null,null,"Other"]
[{"$f":"TRIM(B9&\" \"&C9)","v":"Community Living and Support-All Services Enhanced Rate"},null,"Community Living and Support-All Services Enhanced Rate","15 min","Client Specific","Client Specific","Client Specific","Client Specific","Client Specific"]
["T2013TF Community Living and Supports Indv-ENHANCED","T2013TF","Community Living and Supports Indv-ENHANCED","15 min","Client Specific","Client Specific","Client Specific","Client Specific","Client Specific"]
[{"$f":"TRIM(B11&\" \"&C11)","v":"Community Living and Support-Group-All Services"},null,"Community Living and Support-Group-All Services","15 min",3.35,3.51,4.0599999999999996,4.0599999999999996,4.4400000000000004]
["T2013TFHQ Community Living and Supports-Group","T2013TFHQ","Community Living and Supports-Group","15 min",3.35,3.51,4.0599999999999996,4.0599999999999996,4.4400000000000004]
["T2041 Community Navigator","T2041","Community Navigator","Monthly",162.22999999999999,162.22999999999999,162.22999999999999,162.22999999999999,162.22999999999999]
["T2041U1 Community Navigator Training - Employer of Record","T2041U1","Community Navigator Training - Employer of Record","15 min",13.35,13.35,13.35,13.35,13.35,null,null,"Min Start Date:",{"$f":"MIN('DD Budget'!$G$10:$G$21)","v":"00:00:00"}]
["H2015 Community Networking","H2015","Community Networking","15 min",6.08,6.08,6.67,6.67,7.46]
["H2015U1 Community Networking - Class/Conf","H2015U1","Community Networking - Class/Conf","15 min","Invoice","Invoice","Invoice","Invoice","Invoice"]
["H2015 Community Networking Enhanced Rate","H2015","Community Networking Enhanced Rate","15 min","Client Specific","Client Specific","Client Specific","Client Specific","Client Specific",null,null,"Base Budget Services"]
["H2015HQ Community Networking- Group","H2015HQ","Community Networking- Group","15 min",3.22,3.22,3.41,3.41,3.63,null,null,"T2013TF Community Living and Supports Indv"]
["H2015U2 Community Networking Transportation","H2015U2","Community Networking Transportation","Invoice","Invoice","Invoice","Invoice","Invoice","Invoice",null,null,"T2013TFER Community Living and Supports Indv-ENHANCED"]
["T2038 Community Transition Supports","T2038","Community Transition Supports","Invoice","Invoice","Invoice","Invoice","Invoice","Invoice",null,null,"T2013TFHQ Community Living and Supports-Group"]
["T2025U3 Crisis Behavioral Consultation","T2025U3","Crisis Behavioral Consultation","15 min",33.799999999999997,33.799999999999997,32.19,32.19,32.19,null,null,"Community Living and Support-All Services"]
["H2011HI Crisis Intervention and Stabilization Supports","H2011HI","Crisis Intervention and Stabilization Supports","15 min",9.24,9.24,8.8000000000000007,8.8000000000000007,8.8000000000000007,null,null,"Community Living and Support-All Services Enhanced Rate"]
["T2027 Day Supports-Developmental Day","T2027","Day Supports-Developmental Day","1 hr.",27.86,27.86,30.12,30.12,30.12,null,null,"Community Living and Support-Group-All Services"]
["T2021HQ Day Supports-Group","T2021HQ","Day Supports-Group","1 hr.",16.53,16.53,17.25,17.25,17.97,null,null,"H2015 Community Networking"]
["T2021 Day Supports-Individual","T2021","Day Supports-Individual","1 hr.",27.86,27.86,30.12,30.12,33.21,null,null,"H2015HQ Community Networking- Group"]
["T2021 Day Supports-Individual Enhanced Rate","T2021","Day Supports-Individual Enhanced Rate","1 hr.","Client Specific","Client Specific","Client Specific","Client Specific","Client Specific",null,null,"H2015U1 Community Networking - Class/Conf"]
["T2025U1 Financial Supports","T2025U1","Financial Supports","Monthly",225.98,225.98,215.22,215.22,215.22,null,null,"H2015U2 Community Networking Transportation"]
["T2025U2 FM Supplies","T2025U2","FM Supplies","Invoice","Invoice","Invoice","Invoice","Invoice","Invoice",null,null,"T2027 Day Supports-Developmental Day"]
["S5165 Home Modifications","S5165","Home Modifications","Invoice","Invoice","Invoice","Invoice","Invoice","Invoice",null,null,"T2021HQ Day Supports-Group"]
["T1999 Individual Goods and Services","T1999","Individual Goods and Services","Invoice","Invoice","Invoice","Invoice","Invoice","Invoice",null,null,"T2021 Day Supports-Individual"]
{"$rows_left_out":65}